林地面積
type: TerminologyConcept
description: 木竹が集団して育成している土地及び用材、薪炭材、竹林、その他の林産物を集団的に生育させるために用いている土地の面積。果樹園や庭園は除く。不動産登記簿又は固定資産台帳上の地目にかかわらず、現況が林地の場合を林地とする。他の法人又は個人と土地を共有している場合には、当該法人の持分に相当する面積とする。
created: 2017-12-01
broader: Ta00193
top concept of: TerminologyConceptScheme
in scheme: TerminologyConceptScheme

RDF description of 林地面積
primary topic: 林地面積