林産物の品目
type: TerminologyConcept
description: 保有山林から生産された林産物（立木を購入して生産した素材、栽培きのこ類、林業用苗木などを除く。）の販売又は自らの消費に仕向けたものの品目。
created: 2017-12-01
broader: Ta00601
top concept of: TerminologyConceptScheme
in scheme: TerminologyConceptScheme

RDF description of 林産物の品目
primary topic: 林産物の品目