林産物の販売の有無
type: TerminologyConcept
description: 保有山林から生産された林産物（立木を購入して生産した素材、栽培きのこ類、林業用苗木などを除きます。）について販売があるか否かの別。
created: 2017-12-01
broader: Ta00610
top concept of: TerminologyConceptScheme
in scheme: TerminologyConceptScheme

RDF description of 林産物の販売の有無
primary topic: 林産物の販売の有無