RDF description of 旅費
primary topic: 旅費

旅費
type: TerminologyConcept
description: 教育研究旅費、外国旅費、受託研究旅費等の教育研究のために支出した旅費、又は教育研究旅費を除いた職員旅費、赴任旅費等の額。
created: 2017-12-01
broader: Ta00095
in scheme: TerminologyConceptScheme
top concept of: TerminologyConceptScheme