旅行の有無
type: TerminologyConcept
description: 過去１年間に旅行をしたかどうかの別。仕事や学業などを含めた旅行を対象としている。旅行とは，１泊２日以上にわたって行うすべての旅行をいう。なお，「帰省・訪問などの旅行」及び「業務出張・研修・その他」には，そのついでに観光旅行をした場合も含める。
created: 2017-12-01
broader: Ta00658
top concept of: TerminologyConceptScheme
in scheme: TerminologyConceptScheme

RDF description of 旅行の有無
primary topic: 旅行の有無