RDF description of 留学生以外の外国人学生数
primary topic: 留学生以外の外国人学生数

留学生以外の外国人学生数
type: TerminologyConcept
in scheme: TerminologyConceptScheme
top concept of: TerminologyConceptScheme
broader: Ta00134
created: 2017-12-01
description: 高等教育機関（大学・短期大学・高等専門学校）の学生のうち、日本の国籍を有さず、国費留学生でも私費留学生でもない者の数。主として日本の高等学校又は中等教育学校（後期課程）を卒業して高等教育機関に入学した外国人である。