RDF description of 留学者・海外日本人学校派遣者数
primary topic: 留学者・海外日本人学校派遣者数

留学者・海外日本人学校派遣者数
type: TerminologyConcept
description: 国内又は外国の大学及び国内又は外国の教育研究所へ研修のため６カ月以上継続して派遣されている本務教員（国立大学附属学校へ派遣されている者は除く。）、又は長期研修出張の扱いで文部科学省の委嘱により、在外の日本人学校又は補習授業校に派遣されている本務教員の数。
created: 2017-12-01
broader: Ta00122
in scheme: TerminologyConceptScheme
top concept of: TerminologyConceptScheme