RDF description of 流動負債の額
primary topic: 流動負債の額

流動負債の額
type: TerminologyConcept
in scheme: TerminologyConceptScheme
top concept of: TerminologyConceptScheme
broader: Ta00049
created: 2017-12-01
description: 返済義務が決算日の翌日から１年以内、又は正常営業循環基準内の負債の額。支払手形・買掛金・短期借入金・未払金・未払費用・未払法人税等・繰延税金負債・前受金・預り金・前受収益・賞与引当金などの合計額。