陸上作業への従事の有無
type: TerminologyConcept
description: 過去１年間に自営漁業において、漁業の陸上作業（漁船・漁網等の修理・整備、出漁時の漁具、食料品等の積み込み作業、船の進水、引き上げ、養殖業における給餌作業など）に従事したか否かの別。
created: 2017-12-01
broader: Ta00531
in scheme: TerminologyConceptScheme
top concept of: TerminologyConceptScheme

RDF description of 陸上作業への従事の有無
primary topic: 陸上作業への従事の有無