RDF description of 陸上競技場数
primary topic: 陸上競技場数

陸上競技場数
type: TerminologyConcept
in scheme: TerminologyConceptScheme
top concept of: TerminologyConceptScheme
broader: Ta00407
created: 2017-12-01
description: 主として陸上競技を行うために造られた施設で１周200メートル以上のトラックを有するものの数。トラック内にサッカー、ラグビー等を行う施設がある場合でも陸上競技場として取り扱う。