裏作休耕面積
type: TerminologyConcept
description: 水稲作付地で、裏作を休耕している土地の面積。休耕している土地とは、災害や労力の都合などで過去１年間に作付けをしなかったが、数年のうちに作付けする意思のはっきりしている土地をいう。
created: 2017-12-01
broader: Ta00180
top concept of: TerminologyConceptScheme
in scheme: TerminologyConceptScheme

RDF description of 裏作休耕面積
primary topic: 裏作休耕面積