RDF description of 利益剰余金の額
primary topic: 利益剰余金の額

利益剰余金の額
type: TerminologyConcept
description: 資本金を超える剰余金のうち、利益や積立金等の蓄積によってもたらされる額。利益準備金、任意積立金、繰越利益剰余金。
created: 2017-12-01
broader: Ta00043
in scheme: TerminologyConceptScheme
top concept of: TerminologyConceptScheme