RDF description of 来客用駐車場の有無
primary topic: 来客用駐車場の有無

来客用駐車場の有無
type: TerminologyConcept
in scheme: TerminologyConceptScheme
top concept of: TerminologyConceptScheme
broader: Ta00543
created: 2017-12-01
description: 来客の自動車を一時的に保管できる場所。（地上、地下、立体駐車場など）また、専用駐車場とは、自己所有又は契約等により、その事業所が単独で使用できる来客用の駐車場をいい、共用駐車場とは、他の事業所等と共用で使用しており、その事業所が単独で使用できる区画が明確になっていない来客用の駐車場。