浴室の有無
type: TerminologyConcept
description: 住宅の浴室の有無。浴室とは、入浴又はシャワーを使うことを目的とする室をいい、シャワー室も浴室に含める。
created: 2017-12-01
broader: Ta00569
top concept of: TerminologyConceptScheme
in scheme: TerminologyConceptScheme

RDF description of 浴室の有無
primary topic: 浴室の有無