養成貝数
type: TerminologyConcept
description: 平成15年11月１日現在の生育段階別の養成貝数。採苗を購入して養成した場合は、購入時からの年数ではなく、その稚貝を採苗したときからの経過年数。 また、採苗した稚貝を中間育成で養成した期間は、経過年数に含む。
created: 2017-12-01
broader: Ta00378
top concept of: TerminologyConceptScheme
in scheme: TerminologyConceptScheme

RDF description of 養成貝数
primary topic: 養成貝数