養殖施設数
type: TerminologyConcept
description: 海面養殖業を営むために、築堤等で区切った海面又は海面に敷設した施設（いかだ、はえ縄、さく等）の数。種苗養殖のみに使用した施設は含めない。
created: 2017-12-01
broader: Ta00407
top concept of: TerminologyConceptScheme
in scheme: TerminologyConceptScheme

RDF description of 養殖施設数
primary topic: 養殖施設数