養殖施設の換算面積
type: TerminologyConcept
description: のり養殖において、小間（こま）、柵（さく）、間（けん）などその地方で呼ばれているのり養殖の養殖規模を表す単位の１単位面積を平方メートル単位に換算した面積。
created: 2017-12-01
broader: Ta00209
top concept of: TerminologyConceptScheme
in scheme: TerminologyConceptScheme

RDF description of 養殖施設の換算面積
primary topic: 養殖施設の換算面積