RDF description of 養護職員数
primary topic: 養護職員数

養護職員数
type: TerminologyConcept
in scheme: TerminologyConceptScheme
top concept of: TerminologyConceptScheme
broader: Ta00117
created: 2017-12-01
description: 学校教育法に基づき学校に配置されている職員のうち、看護師、養護士、保健師等の職員の数。