部の通学状況別在学者数
type: TerminologyConcept
description: 特別支援学校の幼稚部、小学部、中学部、高等部の各部別の通学状況別の在学者の数。「寄宿舎」（寄宿舎に入居を許可され、現に居住している者で病気等のため一次不在の者も含む）、「家庭（下宿を含む）」、「児童福祉施設」（児童福祉法に規定する児童福祉施設のうち、児童養護施設、知的障害児施設、盲ろうあ児施設及び肢体不自由児施設）、「国立療養所重心病棟」（児童福祉法により重症心身障害児を収容するために厚生労働大臣が指定する国立療養所）、「その他の医療機関」（前述の児童福祉施設、国立療養所重心病棟以外の病院、療養所、診療所等）に区分される。
created: 2017-12-01
broader: Ta00134
top concept of: TerminologyConceptScheme
in scheme: TerminologyConceptScheme

RDF description of 部の通学状況別在学者数
primary topic: 部の通学状況別在学者数