RDF description of 遊漁案内業者数
primary topic: 遊漁案内業者数

遊漁案内業者数
type: TerminologyConcept
in scheme: TerminologyConceptScheme
top concept of: TerminologyConceptScheme
broader: Ta00379
created: 2017-12-01
description: 過去１年間に遊漁案内業を営んだ業者数。遊漁案内業とは、漁業者、漁業者以外に関わらず、遊漁者から料金を徴収して、漁船、遊漁案内船等を使用して、遊漁者を漁場に案内する業務（船釣り、瀬渡し等）や潮干狩り、観光地びき網、磯釣り等の業務を行うものをいう。なお、遊漁者を遊漁案内業者に斡旋する業務は遊漁案内業とはしない。