RDF description of 遊漁者への啓発・普及のための講習会開催実施主体
primary topic: 遊漁者への啓発・普及のための講習会開催実施主体

遊漁者への啓発・普及のための講習会開催実施主体
type: TerminologyConcept
in scheme: TerminologyConceptScheme
top concept of: TerminologyConceptScheme
broader: Ta00577
created: 2017-12-01
description: 遊漁者等に対し、河川・湖沼における水産資源の保護、遊漁におけるマナー及び外来魚の取り扱いのルール、内水面漁業調整規則等、法律的な専門知識の向上を目的とした講習会の開催等の活動の実施主体。