有形固定資産の資産額_2
type: TerminologyConcept
description: 取得額が10万円以上の建物、構築物、機械装置、土地、建設仮勘定、建物及び付属設備、構築物、機械及び装置、搬送設備及びその他の付属設備、船舶及び水上運搬具、鉄道車両、自動車その他の陸上運搬具、工具、器具及び備品（耐用年数が１年以上のものに限る。）、土地、建設仮勘定、その他の有形資産で流動資産又は投資たる資産に属しないものの額。修繕、増築、改造、購入手数料の費用。
created: 2017-12-01
broader: Ta00030
in scheme: TerminologyConceptScheme
top concept of: TerminologyConceptScheme

RDF description of 有形固定資産の資産額_2
primary topic: 有形固定資産の資産額_2