有給役員数_3
type: TerminologyConcept
description: 法人、団体に所属している従業者（他の会社など別経営の事業所へ派遣している者（労働者派遣法にいう派遣労働者）を含む。在籍出向など当該事業所に籍がありながら他の会社など別経営の事業所で働いている者は、当該事業所から一部でも給与が支払われている場合は含み、当該事業所から給与が支払われていない場合は除く。下請として当該事業所で請け負った仕事を請負先である他の会社など別経営の事業所で行っている者は除く。他の会社など別経営の事業所から派遣されている者（労働者派遣法にいう派遣労働者）は除く。在籍出向など、他の会社など別経営の事業所に籍がありながら当該事業所に来て働いている者は、別経営の事業所から一部でも給与が支払われている場合は除き、別経営の事業所から給与が支払われていない場合は含む。下請として他の会社など別経営の事業所で請け負った仕事を請負先である当該事業所に来て行っている者は除く。）のうち、常勤、非常勤を問わず役員報酬を受けている者の数。役員であっても、ただ単に名目的で業務に従事せず、かつ役員報酬を受けていない者（利益処分による役員賞与のみを受けている者を含む。）は除く。重役や理事などであっても、事務職員、労務職員を兼ねて一定の職務に就き、一般職員と同じ給与規則によって給与を受けている者は除く。ただし、法人格を持つ寺院の住職は、給与の有無に関係なく含む。
created: 2017-12-01
broader: Ta00116
in scheme: TerminologyConceptScheme
narrower: si409020005
narrower: si408010006
narrower: si408010045
narrower: si457010008
narrower: si409020006
narrower: si408020005
narrower: si409010006
narrower: si408020006
narrower: si408010044
narrower: si408010005
narrower: si409010007
narrower: si457010007
top concept of: TerminologyConceptScheme

RDF description of 有給役員数_3
primary topic: 有給役員数_3