輸送人員の増減の理由_1
type: TerminologyConcept
description: 輸送人員が前月に対して20％以上の増減があったとき、その理由が「車両数の増減」、「季節的なもの」、「行事・催物」、「天候・災害」、「その他」などのいずれであるかの別。
created: 2017-12-01
broader: Ta00622
top concept of: TerminologyConceptScheme
in scheme: TerminologyConceptScheme

RDF description of 輸送人員の増減の理由_1
primary topic: 輸送人員の増減の理由_1