輸送した距離
type: TerminologyConcept
description: 貨物の積地から揚地までの航海距離。貨物の船積み又は陸揚げと関係の無い寄港（避難等）の航海距離は含まない。
created: 2017-12-01
broader: Ta00170
top concept of: TerminologyConceptScheme
in scheme: TerminologyConceptScheme

RDF description of 輸送した距離
primary topic: 輸送した距離