輸出体積量
type: TerminologyConcept
description: 輸出量を体積の単位（l、kl、m3、Nm3など）で表したもの。輸出とは、国内から商品を出荷すること。外国にある自企業の支店へ商品を出荷する場合を含む。輸出向け国内生産ボンドも輸出に含まれる。輸入ボンドの再輸出品は含まれない。
created: 2017-12-01
broader: Ta00246
top concept of: TerminologyConceptScheme
in scheme: TerminologyConceptScheme

RDF description of 輸出体積量
primary topic: 輸出体積量