役員給与額
type: TerminologyConcept
description: 常勤、非常勤を問わず、役員（従業員を兼務している役員を含む。）に対して支払う役員報酬、給料、手当等（所得税、保険料等控除前）の額。利益処分による役員賞与は含まない。
created: 2017-12-01
broader: Ta00088
top concept of: TerminologyConceptScheme
in scheme: TerminologyConceptScheme

RDF description of 役員給与額
primary topic: 役員給与額