網膜光凝固術実施件数
type: TerminologyConcept
description: レーザー光線を網膜の部位に照射し、組織を熱凝固させ治療する手術の実施件数。ただし、虹彩光凝固術・冷凍凝固術等は除く。
created: 2017-12-01
broader: Ta00402
top concept of: TerminologyConceptScheme
in scheme: TerminologyConceptScheme

RDF description of 網膜光凝固術実施件数
primary topic: 網膜光凝固術実施件数