無菌治療室病床数
type: TerminologyConcept
description: 白血病、再生不良性貧血、骨髄異形成症候群、重症複合型免疫不全症等の患者に対して無菌治療室管理を行うにふさわしい構造設備等の基準が満たされている室の病床数。
created: 2017-12-01
broader: Ta00462
top concept of: TerminologyConceptScheme
in scheme: TerminologyConceptScheme

RDF description of 無菌治療室病床数
primary topic: 無菌治療室病床数