未処分農産物の品目
type: TerminologyConcept
description: 調査客体が保有している農畜産物で未販売のもの、家計消費予定のもの、農業その他の用に供する予定のものの品目。
created: 2017-12-01
broader: Ta00588
in scheme: TerminologyConceptScheme
top concept of: TerminologyConceptScheme

RDF description of 未処分農産物の品目
primary topic: 未処分農産物の品目