本年３月に学校を卒業した人か否か
type: TerminologyConcept
description: 平成15年３月に中学校以上の学校（中学、高校、高専、専門学校、短大、大学、大学院）を卒業した人か否かの別。
created: 2017-12-01
broader: Ta00513
top concept of: TerminologyConceptScheme
in scheme: TerminologyConceptScheme

RDF description of 本年３月に学校を卒業した人か否か
primary topic: 本年３月に学校を卒業した人か否か