RDF description of 本社・本店数
primary topic: 本社・本店数

本社・本店数
type: TerminologyConcept
description: 「本社・本店」とは、事業全体を管理、統括、運営している事業所。「本社・本店」の同一敷地内に、鉱業、製造業、卸売業、小売業、飲食店等の活動を行っている部門がある場合は「本社・本店」の一部とする。
created: 2017-12-01
broader: Ta00381
in scheme: TerminologyConceptScheme
top concept of: TerminologyConceptScheme