牧草地の借入地面積
type: TerminologyConcept
description: 自己所有以外で農業経営に利用した牧草地の面積。「また小作」している牧草地や牧草の栽培に利用している堤外地などの官公有地、貸した側にいったん返してある牧草地でも引き続き借り入れる見込みのあるものは含める。牧草地とは、畑のうち、牧草の栽培を専用とするもので、生産力維持のため肥培管理、更新等を行っているものをいう。
created: 2017-12-01
broader: Ta00182
top concept of: TerminologyConceptScheme
in scheme: TerminologyConceptScheme

RDF description of 牧草地の借入地面積
primary topic: 牧草地の借入地面積