RDF description of 訪問系サービス利用日数
primary topic: 訪問系サービス利用日数

訪問系サービス利用日数
type: TerminologyConcept
description: 介護保険や市町村事業等（全額自己負担）による訪問介護や訪問入浴介護などの訪問系サービスを利用した日数。
created: 2017-12-01
broader: Ta00360
in scheme: TerminologyConceptScheme
top concept of: TerminologyConceptScheme