RDF description of 訪問教育学級であるか否か
primary topic: 訪問教育学級であるか否か

訪問教育学級であるか否か
type: TerminologyConcept
description: 特別支援学校の小学部、中学部及び高等部の各部の学級について、「訪問教育」を受けている児童生徒のみで編成されている学級に該当するか否かの別。訪問教育とは、学校教育法施行規則に基づき、教員を派遣して教育を行う教育方法である。
created: 2017-12-01
broader: Ta00516
in scheme: TerminologyConceptScheme
top concept of: TerminologyConceptScheme