訪問リハビリテーション実施件数Ａ
type: TerminologyConcept
description: 病状が安定期にあり在宅でリハビリテーションが必要と主治医が認めた要介護者に対し、理学療法士又は作業療法士が自宅を訪問し、心身の機能の維持回復を図り日常生活の自立を助けるために必要なリハビリテーションの実施件数。【平成20年10月1日、定義単位項目「訪問リハビリテーション実施件数」の定義内容変更に伴い、平成20年9月30までの定義を「訪問リハビリテーション実施件数A」として設定。】
created: 2017-12-01
broader: Ta00401
top concept of: TerminologyConceptScheme
in scheme: TerminologyConceptScheme

RDF description of 訪問リハビリテーション実施件数Ａ
primary topic: 訪問リハビリテーション実施件数Ａ