無形固定資産の減価償却費
type: TerminologyConcept
description: 無形固定資産のうち、取得価額が10万円以上で耐用年数が１年以上のもの（減価償却資産）を取得した場合、一度に費用として処理せずに、定額法により、法定耐用年数に配分して費用計上した額。
created: 2017-12-01
broader: Ta00032
top concept of: TerminologyConceptScheme
in scheme: TerminologyConceptScheme

RDF description of 無形固定資産の減価償却費
primary topic: 無形固定資産の減価償却費