法人税・住民税・事業税額
type: TerminologyConcept
description: 中間納付額、追徴税額、還付税額、法人税等調整額等を加減した当該事業年度の法人税、住民税、利益に関連する金額を課税標準とする事業税（所得課税の事業税）の額。
created: 2017-12-01
broader: Ta00086
top concept of: TerminologyConceptScheme
in scheme: TerminologyConceptScheme

RDF description of 法人税・住民税・事業税額
primary topic: 法人税・住民税・事業税額