報酬額
type: TerminologyConcept
description: 給料、歩合給、その他の手当（家族手当、出漁手当、乗船手当、作業手当等）、特別に支払われた報酬、航海日当、その他の手当等の税金・船員保険等を差し引く前の報酬の額。
created: 2017-12-01
broader: Ta00088
top concept of: TerminologyConceptScheme
in scheme: TerminologyConceptScheme

RDF description of 報酬額
primary topic: 報酬額