RDF description of 母体・胎児集中治療室病床数
primary topic: 母体・胎児集中治療室病床数

母体・胎児集中治療室病床数
type: TerminologyConcept
in scheme: TerminologyConceptScheme
top concept of: TerminologyConceptScheme
broader: Ta00462
created: 2017-12-01
description: 母体・胎児集中治療室管理を行うにふさわしい専用の構造設備及び人員配置の基準が満たされている室の病床数。