RDF description of 補正体積量
primary topic: 補正体積量

補正体積量
type: TerminologyConcept
description: 圧縮天然ガスの棚卸しをした場合において、帳簿上の数量と現品との間に増減があったときに、その増減量を体積量の単位（m3）で表したもの。
created: 2017-12-01
broader: Ta00252
in scheme: TerminologyConceptScheme
top concept of: TerminologyConceptScheme