補助活動事業費
type: TerminologyConcept
description: 正規の学校教育活動には含まれないが、それと密接な関係のある学校の事業であり、学生、教職員の福利や厚生補導を目的とする活動に支出した費用の額。「その他の補助活動事業費」は、「学生寄宿舎費」、「課外活動費」、「保健管理費」のいずれにも属さない補助活動事業費であり、職員の健康管理、職員厚生経費、諸謝金、大学会館運営費等が含まれる。
created: 2017-12-01
broader: Ta00095
top concept of: TerminologyConceptScheme
in scheme: TerminologyConceptScheme

RDF description of 補助活動事業費
primary topic: 補助活動事業費