保健主事数
type: TerminologyConcept
description: 学校教育法施行規則に基づき学校に配置される「保健主事」の数。保健主事は、校長の監督を受け、保健に関する事項の管理に当たる教諭又は養護教諭である。
created: 2017-12-01
broader: Ta00122
top concept of: TerminologyConceptScheme
in scheme: TerminologyConceptScheme

RDF description of 保健主事数
primary topic: 保健主事数