返還重量
type: TerminologyConcept
description: 石油化学会社に販売した液化石油ガスが返還された数量や、石油化学会社から受け入れた液化石油ガスの数量。重量の単位（t）。
created: 2017-12-01
broader: Ta00299
in scheme: TerminologyConceptScheme
top concept of: TerminologyConceptScheme

RDF description of 返還重量
primary topic: 返還重量