併設施設の状況
type: TerminologyConcept
description: 同一法人（法人が異なっていても実質的同一経営の場合を含む。）が同一敷地内又は隣接の敷地内で運営している異なる施設の状況。
created: 2017-12-01
broader: Ta00644
top concept of: TerminologyConceptScheme
in scheme: TerminologyConceptScheme

RDF description of 併設施設の状況
primary topic: 併設施設の状況