副学長数
type: TerminologyConcept
description: 高等教育機関（大学・短期大学・高等専門学校）において、学校教育法上の「副学長」として発令されている者の数。副学長とは、学長の職務を助ける者である。
created: 2017-12-01
broader: Ta00122
top concept of: TerminologyConceptScheme
in scheme: TerminologyConceptScheme

RDF description of 副学長数
primary topic: 副学長数