部主事数
type: TerminologyConcept
description: 学校教育法施行規則に基づき、特別支援学校の幼稚部、小学部、中学部、高等部の各部に置くことができる「主事」の数。主事は、その部に属する教諭をもって充てられ、校長の監督を受け、部に関する校務を掌る。
created: 2017-12-01
broader: Ta00122
top concept of: TerminologyConceptScheme
in scheme: TerminologyConceptScheme

RDF description of 部主事数
primary topic: 部主事数