RDF description of 扶養手当の第３位以降の者の数
primary topic: 扶養手当の第３位以降の者の数

扶養手当の第３位以降の者の数
type: TerminologyConcept
in scheme: TerminologyConceptScheme
top concept of: TerminologyConceptScheme
broader: Ta00127
created: 2017-12-01
description: 給与法第１１条第３項の規定により扶養手当の月額が5,000円の者に相当する者をいう。