品名
type: TerminologyConcept
description: 生産費作目の生産に使用した資材（自給牧草を調査する調査客体については、牧草生産に使用した資材）（賃耕、防除、刈取りなどの委託料金等も含む。）の品名。
created: 2017-12-01
broader: Ta00580
top concept of: TerminologyConceptScheme
in scheme: TerminologyConceptScheme

RDF description of 品名
primary topic: 品名