被害歩合
type: TerminologyConcept
description: 基準収量に対して減収あるいは減収するであろうと見込まれる量の割合（百分比）。被害減収推定尺度等を適用して、損傷状態等から推定する。
created: 2017-12-01
broader: Ta00493
top concept of: TerminologyConceptScheme
in scheme: TerminologyConceptScheme

RDF description of 被害歩合
primary topic: 被害歩合